Target
Solute carrier organic anion transporter family member 2A1
Ligand
BDBM144797
Substrate
Meas. Tech.
Inhibition Assay
Temperature
298.15±n/a K
IC50
760±n/a nM
Comments
extracted
Citation
 Schuster, VLChi, YWasmuth, ASPottorf, RSOlson, GL Prostaglandin transporter inhibitors and uses thereof US Patent  US8952150 Publication Date 2/10/2015 
Target
Name:
Solute carrier organic anion transporter family member 2A1
Synonyms:
Matr1 Prostaglandin transporter (PGT) Slc21a2 Solute carrier family 21 member 2
Type:
Protein
Mol. Mass.:
70404.97
Organism:
Rattus norvegicus (Rat)
Description:
Q00910
Residue:
644
  
Inhibitor
Name:
BDBM144797
Synonyms:
US8952150, 44
Type:
Small organic molecule
Emp. Form.:
C35H44N8O5
Mol. Mass.:
656.7745
SMILES:
CCCCCCNC(=O)c1ccc(Nc2nc(NCCOCCOCCNC(=O)c3ccccc3)nc(Nc3ccc(O)cc3)n2)cc1
: