Target
Oligo-1,6-glucosidase IMA1
Ligand
BDBM150768
Substrate
Meas. Tech.
Alpha-glucosidase Assay
Temperature
583.3±0 K
IC50
2.46e+3± 8 nM
Citation
 Rahim, FUllah, KUllah, HWadood, ATaha, MUr Rehman, Auddin, IAshraf, MShaukat, ARehman, WHussain, SKhan, KM Triazinoindole analogs as potent inhibitors of a-glucosidase: synthesis, biological evaluation and molecular docking studies. Bioorg Chem 58:81-7 (2015)  
Target
Name:
Oligo-1,6-glucosidase IMA1
Synonyms:
α-glucosidase Alpha-glucosidase (α-glucosidase) MALX3_YEAST | Oligo-1,6-glucosidase
Type:
Protein
Mol. Mass.:
68577.59
Organism:
Saccharomyces cerevisiae S288c (Baker's yeast)
Description:
Residue:
589
  
Inhibitor
Name:
BDBM150768
Synonyms:
2-(5H-[1,2,4]triazino[5,6-b]indol-3-ylthio)-1-(3-hydroxyphenyl)-ethanone (1)
Type:
Small organic molecule
Emp. Form.:
C17H12N4O2S
Mol. Mass.:
336.368
SMILES:
Oc1cccc(c1)C(=O)CSc1nnc2c(n1)[nH]c1ccccc21
: