Target
Catenin beta-1/Protein Wnt-3a
Ligand
BDBM148377
Substrate
Meas. Tech.
Luciferase Assay
IC50
2000±n/a nM
Citation
 Moriyama, HSawa, MUno, YKashimoto, SYamada, T Quinazoline derivative US Patent  US9682961 Publication Date 6/20/2017 
Target
Name:
Catenin beta-1/Protein Wnt-3a
Synonyms:
Wnt/beta-Catenin
Type:
Protein
Mol. Mass.:
Description:
Components:
This complex has 2 components.
Component 1
Name:
Protein Wnt-3a
Synonyms:
WNT3A | WNT3A_HUMAN
Type:
PROTEIN
Mol. Mass.:
39379.02
Organism:
Homo sapiens (Human)
Description:
ChEMBL_1469237
Residue:
352
  
Component 2
Name:
Catenin beta-1
Synonyms:
CTNB1_HUMAN CTNNB1
Type:
PROTEIN
Mol. Mass.:
85484.08
Organism:
Homo sapiens (Human)
Description:
ChEMBL_1504364
Residue:
781
  
Inhibitor
Name:
BDBM148377
Synonyms:
US9682961, 26
Type:
Small organic molecule
Emp. Form.:
C22H20F3N5O2
Mol. Mass.:
443.4217
SMILES:
O[C@H]1CC[C@H](CC1)Oc1cccc2cnc(Nc3ccc4nc([nH]c4c3)C(F)(F)F)nc12
: