Target
DNA gyrase subunit B
Ligand
BDBM166662
Substrate
Meas. Tech.
GyraseB Assay
pH
7.5±n/a
IC50
3.941e+4± 9.7e+2 nM
Comments
extracted
Citation
 Janupally, RMedepi, BBrindha Devi, PSuryadevara, PJeankumar, VUKulkarni, PYogeeswari, PSriram, D Design and Biological Evaluation of Furan/Pyrrole/Thiophene-2-carboxamide Derivatives as Efficient DNA GyraseB Inhibitors of Staphylococcus aureus. Chem Biol Drug Des 86:918-25 (2015)  
Target
Name:
DNA gyrase subunit B
Synonyms:
DNA gyrase DNA gyrase subunit B (gyrB) gyrB
Type:
Enzyme Subunit
Mol. Mass.:
72530.91
Organism:
Staphylococcus aureus
Description:
Residue:
644
  
Inhibitor
Name:
BDBM166662
Synonyms:
N-(4-(4-Hydrazinyl-4-oxobutanamido)phenyl)furan-2-carboxamide (21)
Type:
Small organic molecule
Emp. Form.:
C15H16N4O4
Mol. Mass.:
316.3119
SMILES:
NNC(=O)CCC(=O)Nc1ccc(NC(=O)c2ccco2)cc1
: