Target
DNA gyrase subunit B
Ligand
BDBM166665
Substrate
Meas. Tech.
GyraseB Assay
pH
7.5±n/a
IC50
3.256e+4± 2.41e+3 nM
Comments
extracted
Citation
 Janupally, RMedepi, BBrindha Devi, PSuryadevara, PJeankumar, VUKulkarni, PYogeeswari, PSriram, D Design and Biological Evaluation of Furan/Pyrrole/Thiophene-2-carboxamide Derivatives as Efficient DNA GyraseB Inhibitors of Staphylococcus aureus. Chem Biol Drug Des 86:918-25 (2015)  
Target
Name:
DNA gyrase subunit B
Synonyms:
DNA gyrase DNA gyrase subunit B (gyrB) gyrB
Type:
Enzyme Subunit
Mol. Mass.:
72530.91
Organism:
Staphylococcus aureus
Description:
Residue:
644
  
Inhibitor
Name:
BDBM166665
Synonyms:
N-(4-(4-Hydrazinyl-4-oxobutanamido)phenyl)thiophene-2-carboxamide (24)
Type:
Small organic molecule
Emp. Form.:
C15H16N4O3S
Mol. Mass.:
332.378
SMILES:
NNC(=O)CCC(=O)Nc1ccc(NC(=O)c2cccs2)cc1
: