Target
Fibroblast growth factor receptor 1
Ligand
BDBM194837
Substrate
Meas. Tech.
High ATP Kinase Assay
pH
7±n/a
Temperature
295.15±n/a K
IC50
0.7±n/a nM
Comments
extracted
Citation
 Brohm, DHeroult, MCollin, MHübsch, WLobell, MLustig, KGrünewald, SBömer, U Disubstituted benzothienyl-pyrrolotriazines and uses thereof US Patent  US9206184 Publication Date 12/8/2015 
Target
Name:
Fibroblast growth factor receptor 1
Synonyms:
BFGFR Basic fibroblast growth factor receptor 1 (FGFR1) CEK FGFR-1 FGFR-1, (FL) FGFR1_HUMAN FLT2 Fibroblast growth factor receptor 1 (FGFR-1) Fms-like tyrosine kinase 2 N-sam bFGF-R | c-fgr
Type:
Receptor
Mol. Mass.:
91861.70
Organism:
Homo sapiens (Human)
Description:
P11362
Residue:
822
  
Inhibitor
Name:
BDBM194837
Synonyms:
US9206184, 18 | US9206184, 19
Type:
Small organic molecule
Emp. Form.:
C24H30N6O2S
Mol. Mass.:
466.599
SMILES:
CCOCc1c(CN2CCNCC2)n2ncnc(N)c2c1-c1cc2cc(C)cc(OC)c2s1
: