Target
5-hydroxytryptamine receptor 4
Ligand
BDBM198002
Substrate
Meas. Tech.
Binding Assay
IC50
0.421±n/a nM
Citation
 Kim, SIm, WChoi, SChoi, SSohn, JSung, HKim, MCho, KSohn, T Benzamide derivatives US Patent  US9221790 Publication Date 12/29/2015 
Target
Name:
5-hydroxytryptamine receptor 4
Synonyms:
5-HT-4 5-HT4S 5-HT4b 5-HT4d 5-hydroxytryptamine receptor 4 5HT4R_HUMAN Serotonin (5-HT) receptor Serotonin 4 (5-HT4) receptor | Serotonin Receptor 4
Type:
Enzyme
Mol. Mass.:
43767.54
Organism:
Homo sapiens (Human)
Description:
Q13639
Residue:
388
  
Inhibitor
Name:
BDBM198002
Synonyms:
US9221790, 12
Type:
Small organic molecule
Emp. Form.:
C20H27ClN4O2
Mol. Mass.:
390.907
SMILES:
COc1cc(N)c(Cl)cc1C(=O)NCC1CCN(Cc2cccn2C)CC1
: