Target
Aldo-keto reductase family 1 member B10 [K125R,V301L]
Ligand
BDBM104022
Substrate
Meas. Tech.
IC50-Activity Assay (AR)
pH
7±n/a
IC50
7.0e+3±n/a nM
Comments
extracted
Citation
 Cousido-Siah, ARuiz, FXFranflík, JGiménez-Dejoz, JMitschler, AKamlar, MVesely´, JAjani, HParés, XFarrés, JHobza, PPodjarny, AD IDD388 Polyhalogenated Derivatives as Probes for an Improved Structure-Based Selectivity of AKR1B10 Inhibitors ACS Chem Biol 11:2693-2705 (2016)  
Target
Name:
Aldo-keto reductase family 1 member B10 [K125R,V301L]
Synonyms:
AK1BA_HUMAN AKR1B11 | Methylated AKR1B10 K125R/V301L (AKME2MU)
Type:
Protein
Mol. Mass.:
36066.71
Organism:
Homo sapiens (Human)
Description:
Methylated form of AKR1B10 with mutations K125R and V301L; 4XLJ; 4XLK; 4XM9; 4XLM; 4XMJ; 4XZL; 4WEV
Residue:
316
  
Inhibitor
Name:
BDBM104022
Synonyms:
MK319
Type:
Small organic molecule
Emp. Form.:
C16H9BrClF4NO4
Mol. Mass.:
470.598
SMILES:
OC(=O)COc1cc(Cl)ccc1C(=O)NCc1c(F)c(F)c(Br)c(F)c1F
: