Target
Acyl-protein thioesterase 2 [S122A]
Ligand
BDBM207994
Substrate
Meas. Tech.
Fluorescence Binding Assays
Temperature
298.15±n/a K
IC50
7.1e+3±n/a nM
Kd
2600±0.0 nM
Comments
extracted
Citation
 Won, SJDavda, DLabby, KJHwang, SYPricer, RMajmudar, JDArmacost, KARodriguez, LARodriguez, CLChong, FSTorossian, KAPalakurthi, JHur, ESMeagher, JLBrooks, CLStuckey, JAMartin, BR Molecular Mechanism for Isoform-Selective Inhibition of Acyl Protein Thioesterases 1 and 2 (APT1 and APT2). ACS Chem Biol 11:3374-3382 (2016)  
Target
Name:
Acyl-protein thioesterase 2 [S122A]
Synonyms:
APT2 LYPA2_HUMAN | LYPLA2
Type:
Protein
Mol. Mass.:
24724.23
Organism:
Homo sapiens (Human)
Description:
Human APT2 with S122A mutation
Residue:
231
  
Inhibitor
Name:
BDBM207994
Synonyms:
ML349-sulfoxide
Type:
Small organic molecule
Emp. Form.:
C23H22N2O3S2
Mol. Mass.:
438.562
SMILES:
COc1ccc(cc1)N1CCN(CC1)C(=O)c1cc2CS(=O)c3ccccc3-c2s1
: