Target
Aldo-keto reductase family 1 member C1
Ligand
BDBM50427624
Substrate
Meas. Tech.
Inhibition Assay
IC50
76.25±n/a nM
Citation
 Marnett, LJLiedtke, AJPenning, TMAdeniji, AOByrns, MC Indomethacin analogs for the treatment of castrate-resistant prostate cancer US Patent  US9346803 Publication Date 5/24/2016 
Target
Name:
Aldo-keto reductase family 1 member C1
Synonyms:
20-alpha-HSD AK1C1_HUMAN Aldo-keto reductase family 1 member C1 (AK1C1) Aldo-keto reductase family 1 member C1 (AKR1C1) DDH High-affinity hepatic bile acid-binding protein | Trans-1,2-dihydrobenzene-1,2-diol dehydrogenase
Type:
Enzyme
Mol. Mass.:
36793.97
Organism:
Homo sapiens (Human)
Description:
Recombinant AKR1C1 enzyme was expressed in E. coli.
Residue:
323
  
Inhibitor
Name:
BDBM50427624
Synonyms:
CHEMBL2323522 | US9346803, Table 2, Compound 11: 9-(4-chlorobenzoyl)-6-methoxy-2,3,4,9-tetrahydro-1H-carbazole-3-carboxylic acid
Type:
Small organic molecule
Emp. Form.:
C21H18ClNO4
Mol. Mass.:
383.825
SMILES:
COc1ccc2n(C(=O)c3ccc(Cl)cc3)c3CCC(Cc3c2c1)C(O)=O
: