Target
N-acylethanolamine-hydrolyzing acid amidase
Ligand
BDBM50389023
Substrate
Meas. Tech.
Fluorogenic Assay
pH
4.5±n/a
IC50
14±n/a nM
Comments
extracted
Citation
 Piomelli, DBandiera, TMor, MTarzia, GBertozzi, FPonzano, S Disubstituted beta-lactones as inhibitors of N-acylethanolamine acid amidase (NAAA) US Patent  US9353075 Publication Date 5/31/2016 
Target
Name:
N-acylethanolamine-hydrolyzing acid amidase
Synonyms:
ASAH-like protein Acid ceramidase-like protein N-acylsphingosine amidohydrolase-like NAAA PLT
Type:
Enzyme
Mol. Mass.:
40073.12
Organism:
Homo sapiens (Human)
Description:
Q02083
Residue:
359
  
Inhibitor
Name:
BDBM50389023
Synonyms:
CHEMBL2064166 | US9353075, 6
Type:
Small organic molecule
Emp. Form.:
C16H21NO4
Mol. Mass.:
291.3422
SMILES:
C[C@@H]1OC(=O)[C@@H]1NC(=O)OCCCCCc1ccccc1
: