Target
Alpha-1,3-mannosyl-glycoprotein 2-beta-N-acetylglucosaminyltransferase
Ligand
BDBM294276
Substrate
Meas. Tech.
Radioligand Binding Assay
Ki
<10.00±n/a nM
Citation
 Amberg, WPohlki, FLange, UWang, YBrewer, JVasudevan, ALao, YHutchins, CZhao, HLi, H Aminochromane, aminothiochromane and amino-1,2,3,4-tetrahydroquinoline derivatives, pharmaceutical compositions containing them, and their use in therapy US Patent  US9586945 Publication Date 3/7/2017 
Target
Name:
Alpha-1,3-mannosyl-glycoprotein 2-beta-N-acetylglucosaminyltransferase
Synonyms:
GGNT1 GLYT1 GlcNAc-T I MGAT1 N-glycosyl-oligosaccharide-glycoprotein N-acetylglucosaminyltransferase I
Type:
PROTEIN
Mol. Mass.:
50891.32
Organism:
Homo sapiens (Human)
Description:
ChEMBL_107587
Residue:
445
  
Inhibitor
Name:
BDBM294276
Synonyms:
Cis-N-(1-(4-benzyl-7-fluoro-3-(methylamino)chroman-6-yl)azetidin-3-yl)propane-1-sulfonamide—Isomer 1 US9586945, 28
Type:
Small organic molecule
Emp. Form.:
C23H30FN3O3S
Mol. Mass.:
447.566
SMILES:
CCCS(=O)(=O)NC1CN(C1)c1cc2C(Cc3ccccc3)C(COc2cc1F)NC
: