Target
cAMP-dependent protein kinase catalytic subunit alpha
Ligand
BDBM6780
Substrate
Lysine-rich histone
Meas. Tech.
CDK Kinase Inhibition Assay
Temperature
298.15±n/a K
IC50
>20000±n/a nM
Comments
extracted
Citation
 Sanchez-Martinez, CShih, CZhu, GLi, TBrooks, HBPatel, BKSchultz, RMDeHahn, TBSpencer, CDWatkins, SAOgg, CAConsidine, EDempsey, JAZhang, F Studies on cyclin-dependent kinase inhibitors: indolo-[2,3-a]pyrrolo[3,4-c]carbazoles versus bis-indolylmaleimides. Bioorg Med Chem Lett 13:3841-6 (2003)  
Target
Name:
cAMP-dependent protein kinase catalytic subunit alpha
Synonyms:
KAPCA_BOVIN PKC Protein Kinase C cAMP-Dependent Protein Kinase (PKA) cAMP-dependent protein kinase A cAMP-dependent protein kinase, alpha-catalytic subunit
Type:
Enzyme Complex
Mol. Mass.:
40627.77
Organism:
Bos taurus (bovine)
Description:
The PKA holoenzyme purified from bovine heart, exists as an inactive tetrameric complex, which consists of a regulatory dimer associated with two catalytic subunits. It requires cAMP to activate the enzymatic reaction.
Residue:
351
  
Inhibitor
Name:
BDBM6780
Synonyms:
3-[1-(2,3-dihydroxypropyl)-1H-indol-3-yl]-4-(1-methyl-1H-indol-3-yl)-2,5-dihydro-1H-pyrrole-2,5-dione | bis-indolylmaleimide deriv. 8j
Type:
Small organic molecule
Emp. Form.:
C24H21N3O4
Mol. Mass.:
415.4412
SMILES:
Cn1cc(C2=C(C(=O)NC2=O)c2cn(CC(O)CO)c3ccccc23)c2ccccc12
:
Substrate
Name:
Lysine-rich histone
Synonyms:
ING Peptide histone type IIIS
Type:
Peptide
Mol. Mass.:
10508.21
Organism:
Bos taurus (bovine)
Description:
Purified as a lysine rich fraction of histone H1 from calf thymus.
Residue:
105