Target
Replicase polyprotein 1ab
Ligand
BDBM228619
Substrate
Meas. Tech.
3CLpro enzyme assay
IC50
6810±n/a nM
Citation
 Zhu, WXu, MChen, CZGuo, HShen, MHu, XShinn, PKlumpp-Thomas, CMichael, SGZheng, W Identification of SARS-CoV-2 3CL Protease Inhibitors by a Quantitative High-throughput Screening. bioRxiv 0:0 (2020)  
Target
Name:
Replicase polyprotein 1ab
Synonyms:
ORF1ab polyprotein pp1ab | rep
Type:
Protein
Mol. Mass.:
794070.71
Organism:
2019-nCoV
Description:
P0DTD1
Residue:
7096
  
Inhibitor
Name:
BDBM228619
Synonyms:
US9345789, Z-DEVD-FMK
Type:
Small organic molecule
Emp. Form.:
C30H41FN4O12
Mol. Mass.:
668.6645
SMILES:
COC(=O)CC[C@H](NC(=O)[C@H](CC(=O)OC)NC(=O)OCc1ccccc1)C(=O)N[C@@H](C(C)C)C(=O)N[C@@H](CC(=O)OC)C(=O)CF
: