Target
Replicase polyprotein 1ab
Ligand
BDBM50285551
Substrate
Meas. Tech.
3CLpro enzyme assay
IC50
23540±n/a nM
Citation
 Zhu, WXu, MChen, CZGuo, HShen, MHu, XShinn, PKlumpp-Thomas, CMichael, SGZheng, W Identification of SARS-CoV-2 3CL Protease Inhibitors by a Quantitative High-throughput Screening. bioRxiv 0:0 (2020)  
Target
Name:
Replicase polyprotein 1ab
Synonyms:
ORF1ab polyprotein pp1ab | rep
Type:
Protein
Mol. Mass.:
794070.71
Organism:
2019-nCoV
Description:
P0DTD1
Residue:
7096
  
Inhibitor
Name:
BDBM50285551
Synonyms:
3-Carboxy-2-hexadecyl-3-hydroxy-pentanedioic acid CHEMBL78764
Type:
Small organic molecule
Emp. Form.:
C22H40O7
Mol. Mass.:
416.5488
SMILES:
CCCCCCCCCCCCCCCCC(C(O)=O)C(O)(CC(O)=O)C(O)=O
: