Target
Replicase polyprotein 1ab
Ligand
BDBM50168081
Substrate
Meas. Tech.
SARS-CoV-2 CPE assay
EC50
3160±n/a nM
Citation
 Zhu, WXu, MChen, CZGuo, HShen, MHu, XShinn, PKlumpp-Thomas, CMichael, SGZheng, W Identification of SARS-CoV-2 3CL Protease Inhibitors by a Quantitative High-throughput Screening. bioRxiv 0:0 (2020)  
Target
Name:
Replicase polyprotein 1ab
Synonyms:
ORF1ab polyprotein pp1ab | rep
Type:
Protein
Mol. Mass.:
794070.71
Organism:
2019-nCoV
Description:
P0DTD1
Residue:
7096
  
Inhibitor
Name:
BDBM50168081
Synonyms:
CHEMBL3799802 | MK 0893
Type:
Small organic molecule
Emp. Form.:
C32H27Cl2N3O4
Mol. Mass.:
588.48
SMILES:
COc1ccc2cc(ccc2c1)-c1cc(nn1C(C)c1ccc(cc1)C(=O)NCCC(O)=O)-c1cc(Cl)cc(Cl)c1
: