Target
Dual specificity calcium/calmodulin-dependent 3',5'-cyclic nucleotide phosphodiesterase 1A
Ligand
BDBM278973
Substrate
Meas. Tech.
PDE1 Inhibition Assay
IC50
0.800±n/a nM
Citation
 Kehler, JJuhl, KMarigo, MVital, PJJessing, MLanggård, MRasmussen, LKClementson, CM 1 H-pyrazolo[4,3-B]pyridines as PDE1 inhibitors US Patent  US10512632 Publication Date 12/24/2019 
Target
Name:
Dual specificity calcium/calmodulin-dependent 3',5'-cyclic nucleotide phosphodiesterase 1A
Synonyms:
61 kDa Cam-PDE Cam-PDE 1A PDE1A_HUMAN | hCam-1
Type:
Protein
Mol. Mass.:
61245.69
Organism:
Homo sapiens (Human)
Description:
P54750
Residue:
535
  
Inhibitor
Name:
BDBM278973
Synonyms:
5-(2-ethoxy-3-pyridyl)-1-isopropyl-3-methyl-N-[(5-methylisoxazol-3-yl)methyl]pyrazolo[4,3-b]pyridin-7-amine US10512632, Example 3 US10806718, Example 3 US11491140, Example 3 | US11634416, Example 3
Type:
Small organic molecule
Emp. Form.:
C22H26N6O2
Mol. Mass.:
406.4808
SMILES:
CCOc1ncccc1-c1cc(NCc2cc(C)on2)c2n(nc(C)c2n1)C(C)C
: