Target
Activin receptor type-1 [172-499]
Ligand
BDBM451806
Substrate
Meas. Tech.
ADPGlo Assay
IC50
7.00±n/a nM
Citation
 Arista, LBabu, SBian, JCui, KDillon, MPLattmann, RLi, JLiao, LLizos, DRamos, RStiefl, NJUllrich, TUsselmann, PWang, XWaykole, LMWeiler, SZhang, YZhou, YZhu, T Aminopyridine derivatives and their use as selective ALK-2 inhibitors US Patent  US10710980 Publication Date 7/14/2020 
Target
Name:
Activin receptor type-1 [172-499]
Synonyms:
ACVR1 ACVRLK2 Activin receptor-like kinase 2 (ALK-2)(aa 172-499) | Activin receptor-like kinase 2 (ALK2)(172-499)
Type:
Enzyme Catalytic Domain
Mol. Mass.:
37139.64
Organism:
Homo sapiens (Human)
Description:
aa 172-499
Residue:
328
  
Inhibitor
Name:
BDBM451806
Synonyms:
US10710980, Example 38 | US10947218, Example 38
Type:
Small organic molecule
Emp. Form.:
C27H34N4O3
Mol. Mass.:
462.5839
SMILES:
Nc1ncc(cc1C(=O)N[C@H]1CC[C@H](O)CC1)-c1ccc(cc1)[C@]12C[C@H]1CN(CC1COC1)C2
: