Target
cAMP-specific 3',5'-cyclic phosphodiesterase 4A [2-825]
Ligand
BDBM457828
Substrate
Meas. Tech.
Scintillation Proximity Assay (SPA)
IC50
1.000±n/a nM
Citation
 Chappie, TAPatel, NCVerhoest, PRHelal, CJSciabola, SLaChapelle, EAWager, TTHayward, MM 6,7-dihydro-5H-pyrazolo[5,1-b][1,3]oxazine-2-carboxamide compounds US Patent  US10738063 Publication Date 8/11/2020 
Target
Name:
cAMP-specific 3',5'-cyclic phosphodiesterase 4A [2-825]
Synonyms:
DPDE2 PDE4A_HUMAN | cAMP-specific 3',5'-cyclic phosphodiesterase (PDE4A3) (2-825)
Type:
Enzyme Catalytic Domain
Mol. Mass.:
92170.87
Organism:
Homo sapiens (Human)
Description:
aa 2-825
Residue:
824
  
Inhibitor
Name:
BDBM457828
Synonyms:
US10738063, Example 58
Type:
Small organic molecule
Emp. Form.:
C17H15ClF3N3O2
Mol. Mass.:
385.768
SMILES:
Cc1cc(Cl)c(F)cc1-c1c2OCC(F)(F)Cn2nc1C(=O)NC1CC1
: