Target
PAS domain-containing serine/threonine-protein kinase
Ligand
BDBM463453
Substrate
Meas. Tech.
Biochemical Assay
IC50
<1000±n/a nM
Citation
 McCall, JMRomero, DLMcKearn, JClare, M Heterocyclic compounds for the inhibition of PASK US Patent  US10781185 Publication Date 9/22/2020 
Target
Name:
PAS domain-containing serine/threonine-protein kinase
Synonyms:
KIAA0135 PASK PASK_HUMAN | hPASK
Type:
PROTEIN
Mol. Mass.:
142867.26
Organism:
Homo sapiens (Human)
Description:
ChEMBL_944230
Residue:
1323
  
Inhibitor
Name:
BDBM463453
Synonyms:
2-phenyl-3-(4-(quinolin-2-yl)piperazin-1-yl)quinoxaline-6-carboxylic acid US11459307, Example 21
Type:
Small organic molecule
Emp. Form.:
C28H23N5O2
Mol. Mass.:
461.5145
SMILES:
OC(=O)c1ccc2nc(-c3ccccc3)c(nc2c1)N1CCN(CC1)c1ccc2ccccc2n1
: