Target
cAMP-specific 3',5'-cyclic phosphodiesterase 4B
Ligand
BDBM463566
Substrate
Meas. Tech.
Inhibition In Vitro Assay
IC50
0.130±n/a nM
Citation
 Deng, GGHuang, DJesudason, CDOdingo, JO Azetidinyloxyphenylpyrrolidine compounds US Patent  US10781202 Publication Date 9/22/2020 
Target
Name:
cAMP-specific 3',5'-cyclic phosphodiesterase 4B
Synonyms:
3',5'-cyclic phosphodiesterase Isoform PDE4B1 PDE4B PDE4B_HUMAN Phosphodiesterase 4B (PDE4B) Phosphodiesterase Type 4 (PDE4B)
Type:
Protein
Mol. Mass.:
83318.87
Organism:
Homo sapiens (Human)
Description:
Q07343
Residue:
736
  
Inhibitor
Name:
BDBM463566
Synonyms:
(S)-2,3-dihydroxy-1-((3S,4S)-3-((R)-1-hydroxyethyl)-4-(4-methoxy-3-((1-(5-(methyl-D3) pyridin-2-yl)azetidin-3-yl)oxy)phenyl)-3-methylpyrrolidin-1-yl)propan-1-one | US10781202, Example 14
Type:
Small organic molecule
Emp. Form.:
C25H34N4O6
Mol. Mass.:
486.5607
SMILES:
COc1ccc(cc1OC1CN(C1)c1cnc(C)cn1)[C@@H]1CN(C[C@@]1(C)[C@@H](C)O)C(=O)[C@@H](O)CO
: