Target
Bile acid receptor
Ligand
BDBM465619
Substrate
Meas. Tech.
Binding Assay
EC50
2.00±n/a nM
Citation
 Chao, JJain, RHu, LLewis, JGBaribault, HCaldwell, J Hormone receptor modulators for treating metabolic conditions and disorders US Patent  US10793568 Publication Date 10/6/2020 
Target
Name:
Bile acid receptor
Synonyms:
BAR FXR HRR1 NR1H4_HUMAN RIP14 Retinoid X receptor-interacting protein 14 | farnesoid x receptor
Type:
Nuclear Receptor
Mol. Mass.:
55916.24
Organism:
Homo sapiens (Human)
Description:
Q96RI1
Residue:
486
  
Inhibitor
Name:
BDBM465619
Synonyms:
US10793568, Compound I-270
Type:
Small organic molecule
Emp. Form.:
C31H30ClN3O5S
Mol. Mass.:
592.105
SMILES:
Cc1cccc(Cl)c1-c1noc(C2CC2)c1CO[C@@H]1C[C@@H]2C[C@H]1CN2c1nc2c(OC3CC3)cc(cc2s1)C(O)=O
: