Target
Bile acid receptor
Ligand
BDBM465682
Substrate
Meas. Tech.
Binding Assay
EC50
1.58±n/a nM
Citation
 Chao, JJain, RHu, LLewis, JGBaribault, HCaldwell, J Hormone receptor modulators for treating metabolic conditions and disorders US Patent  US10793568 Publication Date 10/6/2020 
Target
Name:
Bile acid receptor
Synonyms:
BAR FXR HRR1 NR1H4_HUMAN RIP14 Retinoid X receptor-interacting protein 14 | farnesoid x receptor
Type:
Nuclear Receptor
Mol. Mass.:
55916.24
Organism:
Homo sapiens (Human)
Description:
Q96RI1
Residue:
486
  
Inhibitor
Name:
BDBM465682
Synonyms:
US10793568, Compound I-333
Type:
Small organic molecule
Emp. Form.:
C32H32Cl2FN3O7S
Mol. Mass.:
692.582
SMILES:
Fc1cc(ccc1C(=O)NS(=O)(=O)CC1CCOCC1)N1[C@@H]2C[C@@H](OCc3c(onc3-c3c(Cl)cccc3Cl)C3CC3)[C@@H](C2)C1=O
: