Target
Probable integral membrane cytochrome D ubiquinol oxidase (Subunit II) CydB (Cytochrome BD-I oxidase subunit II)
Ligand
BDBM466326
Substrate
Meas. Tech.
Mtb cytochrome bd inhibition assay
IC50
270±60 nM
Citation
 Biagini, GAWard, SANixon, GLO''Neill, PM Combination of respiratory electron transport chain inhibitors with a cytochrome bd inhibitor US Patent  US10799494 Publication Date 10/13/2020 
Target
Name:
Probable integral membrane cytochrome D ubiquinol oxidase (Subunit II) CydB (Cytochrome BD-I oxidase subunit II)
Synonyms:
Type:
Protein
Mol. Mass.:
37630.78
Organism:
Description:
O06139
Residue:
346
 
Inhibitor
Name:
BDBM466326
Synonyms:
US10799494, Compound MTD-403
Type:
Small organic molecule
Emp. Form.:
C21H20F2N2O
Mol. Mass.:
354.3931
SMILES:
Cc1c([nH]c2cc(F)cc(F)c2c1=O)-c1ccc(cc1)N1CCCCC1
: