Target
N-formyl peptide receptor 2
Ligand
BDBM350548
Substrate
Meas. Tech.
FLIPR
EC50
11.0±n/a nM
Citation
 Viswanath, VBeard, RLDonello, JEHsia, E Use of agonists of formyl peptide receptor 2 for treating dermatological diseases US Patent  US10799518 Publication Date 10/13/2020 
Target
Name:
N-formyl peptide receptor 2
Synonyms:
ALXR, FPRL1, FPR2 FPR2 FPRH1 Formyl Peptide Receptor-Like 1 LXA4 receptor Lipoxin A4 receptor RFP | hFPRL
Type:
G Protein-Coupled Receptor (GPCR)
Mol. Mass.:
38968.35
Organism:
Homo sapiens (Human)
Description:
P25090
Residue:
351
  
Inhibitor
Name:
BDBM350548
Synonyms:
2-{[(4- bromophenyl)carbamoyl]amino}-N- (2-oxoazepan-3-yl)-3- phenylpropanamide US10434112, Compound 10 | US10799518, Compound 10
Type:
Small organic molecule
Emp. Form.:
C22H25BrN4O3
Mol. Mass.:
473.363
SMILES:
Brc1ccc(NC(=O)NC(Cc2ccccc2)C(=O)NC2CCCCNC2=O)cc1
: