Target
N-formyl peptide receptor 2
Ligand
BDBM350599
Substrate
Meas. Tech.
FLIPR
EC50
9.20±n/a nM
Citation
 Viswanath, VBeard, RLDonello, JEHsia, E Use of agonists of formyl peptide receptor 2 for treating dermatological diseases US Patent  US10799518 Publication Date 10/13/2020 
Target
Name:
N-formyl peptide receptor 2
Synonyms:
ALXR, FPRL1, FPR2 FPR2 FPRH1 Formyl Peptide Receptor-Like 1 LXA4 receptor Lipoxin A4 receptor RFP | hFPRL
Type:
G Protein-Coupled Receptor (GPCR)
Mol. Mass.:
38968.35
Organism:
Homo sapiens (Human)
Description:
P25090
Residue:
351
  
Inhibitor
Name:
BDBM350599
Synonyms:
1-(4-bromo-2-fluorophenyl)- 3-[4-2,5-dioxo-4- (propan-2-yl)imidazolidin-1- yl]urea US10434112, Compound 61 | US10799518, Compound 61
Type:
Small organic molecule
Emp. Form.:
C15H18BrFN4O3
Mol. Mass.:
401.231
SMILES:
CCC1(NC(=O)N(NC(=O)Nc2ccc(Br)cc2F)C1=O)C(C)C
: