Target
N-formyl peptide receptor 2
Ligand
BDBM350615
Substrate
Meas. Tech.
FLIPR
EC50
1.10±n/a nM
Citation
 Viswanath, VBeard, RLDonello, JEHsia, E Use of agonists of formyl peptide receptor 2 for treating dermatological diseases US Patent  US10799518 Publication Date 10/13/2020 
Target
Name:
N-formyl peptide receptor 2
Synonyms:
ALXR, FPRL1, FPR2 FPR2 FPRH1 Formyl Peptide Receptor-Like 1 LXA4 receptor Lipoxin A4 receptor RFP | hFPRL
Type:
G Protein-Coupled Receptor (GPCR)
Mol. Mass.:
38968.35
Organism:
Homo sapiens (Human)
Description:
P25090
Residue:
351
  
Inhibitor
Name:
BDBM350615
Synonyms:
(2S)-N-(2-amino-2-oxoethyl)- 2-{[(4- bromophenyl)carbamoyl]amino}- 4-methylpentanamide US10434112, Compound 77 | US10799518, Compound 77
Type:
Small organic molecule
Emp. Form.:
C15H21BrN4O3
Mol. Mass.:
385.256
SMILES:
CC(C)C[C@H](NC(=O)Nc1ccc(Br)cc1)C(=O)NCC(N)=O
: