Target
DNA-directed RNA polymerase subunit alpha
Ligand
BDBM466512
Substrate
Meas. Tech.
Assay of Inhibition of Staphylococcus Aureus RNA Polymerase
IC50
13000±n/a nM
Citation
 Ebright, RHShen, J Arylpropionyl-triketone antibacterial agents US Patent  US10800725 Publication Date 10/13/2020 
Target
Name:
DNA-directed RNA polymerase subunit alpha
Synonyms:
RNA polymerase subunit alpha RPOA_STAAN rpoA
Type:
Protein
Mol. Mass.:
34991.14
Organism:
Description:
P66706
Residue:
314
 
Inhibitor
Name:
BDBM466512
Synonyms:
US10800725, Compound 20
Type:
Small organic molecule
Emp. Form.:
C31H46O4
Mol. Mass.:
482.6945
SMILES:
CC(C)CCC1=C(O)C(CCC(C)C)(CCC(C)C)C(=O)C(C(=O)C(C)Cc2ccccc2)=C1O
: