Target
DNA-directed RNA polymerase subunit alpha
Ligand
BDBM466517
Substrate
Meas. Tech.
Assay of Inhibition of Mycobacterium tuberculosis RNA Polymerase
IC50
1100±n/a nM
Citation
 Ebright, RHShen, J Arylpropionyl-triketone antibacterial agents US Patent  US10800725 Publication Date 10/13/2020 
Target
Name:
DNA-directed RNA polymerase subunit alpha
Synonyms:
RNA polymerase subunit alpha RPOA_MYCTU rpoA
Type:
Protein
Mol. Mass.:
37685.84
Organism:
Description:
P9WGZ1
Residue:
347
 
Inhibitor
Name:
BDBM466517
Synonyms:
US10800725, Compound 5
Type:
Small organic molecule
Emp. Form.:
C31H46O5
Mol. Mass.:
498.6939
SMILES:
COc1cccc(CCC(=O)C2=C(O)C(CCC(C)C)=C(O)C(CCC(C)C)(CCC(C)C)C2=O)c1
: