Target
DNA-directed RNA polymerase subunit alpha
Ligand
BDBM466525
Substrate
Meas. Tech.
Assay of Inhibition of Staphylococcus Aureus RNA Polymerase
IC50
5300±n/a nM
Citation
 Ebright, RHShen, J Arylpropionyl-triketone antibacterial agents US Patent  US10800725 Publication Date 10/13/2020 
Target
Name:
DNA-directed RNA polymerase subunit alpha
Synonyms:
RNA polymerase subunit alpha RPOA_STAAN rpoA
Type:
Protein
Mol. Mass.:
34991.14
Organism:
Description:
P66706
Residue:
314
 
Inhibitor
Name:
BDBM466525
Synonyms:
US10800725, Compound 13
Type:
Small organic molecule
Emp. Form.:
C24H31ClO4
Mol. Mass.:
418.954
SMILES:
CCCC1=C(O)C(CCC)(CCC)C(=O)C(C(=O)CCc2ccc(Cl)cc2)=C1O
: