Target
4-aminobutyrate aminotransferase, mitochondrial
Ligand
BDBM466532
Substrate
Meas. Tech.
Evaluation of Compounds as Inhibitors of GABA-AT
Ki
182000±n/a nM
Citation
 Silverman, RBLe, HVHawker, DD Tetrahydrothiophene-based GABA aminotransferase inactivators and analogs thereof for treating neurological disorders US Patent  US10800753 Publication Date 10/13/2020 
Target
Name:
4-aminobutyrate aminotransferase, mitochondrial
Synonyms:
(S)-3-amino-2-methylpropionate transaminase ABAT GABA transaminase GABA-T GABT_HUMAN L-AIBAT
Type:
PROTEIN
Mol. Mass.:
56449.39
Organism:
Homo sapiens (Human)
Description:
ChEMBL_1459248
Residue:
500
  
Inhibitor
Name:
BDBM466532
Synonyms:
US10800753, Compound 17
Type:
Small organic molecule
Emp. Form.:
C6H11NO2S
Mol. Mass.:
161.222
SMILES:
COC(=O)[C@@H]1C[C@H](N)CS1
: