Target
Histone deacetylase 2
Ligand
BDBM163625
Substrate
Meas. Tech.
HDAC Inhibition
IC50
5820±n/a nM
Citation
 Liao, DRoush, WRStowe, RL HDAC inhibitor compounds and methods of treatment US Patent  US10807944 Publication Date 10/20/2020 
Target
Name:
Histone deacetylase 2
Synonyms:
Cereblon/Histone deacetylase 2 HDAC2 Histone deacetylase 2 (HDAC2) | Human HDAC2
Type:
Chromatin regulator; hydrolase; repressor
Mol. Mass.:
55356.54
Organism:
Homo sapiens (Human)
Description:
Q92769
Residue:
488
  
Inhibitor
Name:
BDBM163625
Synonyms:
SR-3210 US11731934, Compound RLS2-133
Type:
Small organic molecule
Emp. Form.:
C11H15ClN2O
Mol. Mass.:
226.703
SMILES:
CCCCNNC(=O)c1ccc(Cl)cc1
: