Target
Histone deacetylase 1
Ligand
BDBM468590
Substrate
Meas. Tech.
HDAC Inhibition
IC50
>50000±n/a nM
Citation
 Liao, DRoush, WRStowe, RL HDAC inhibitor compounds and methods of treatment US Patent  US10807944 Publication Date 10/20/2020 
Target
Name:
Histone deacetylase 1
Synonyms:
Cereblon/Histone deacetylase 1 HDAC1 Histone deacetylase 1 (HDAC1) RPD3L1
Type:
Enzyme
Mol. Mass.:
55090.27
Organism:
Homo sapiens (Human)
Description:
Q13547
Residue:
482
  
Inhibitor
Name:
BDBM468590
Synonyms:
US10807944, Compound RLS2-249 | US11731934, Compound RLS2-249
Type:
Small organic molecule
Emp. Form.:
C19H24N2O
Mol. Mass.:
296.4067
SMILES:
O=C(NNCCCC1CCCC1)c1ccc2ccccc2c1
: