Target
Histone deacetylase 2
Ligand
BDBM163633
Substrate
Meas. Tech.
HDAC Inhibition
IC50
28450±n/a nM
Citation
 Liao, DRoush, WRStowe, RL HDAC inhibitor compounds and methods of treatment US Patent  US10807944 Publication Date 10/20/2020 
Target
Name:
Histone deacetylase 2
Synonyms:
Cereblon/Histone deacetylase 2 HDAC2 Histone deacetylase 2 (HDAC2) | Human HDAC2
Type:
Chromatin regulator; hydrolase; repressor
Mol. Mass.:
55356.54
Organism:
Homo sapiens (Human)
Description:
Q92769
Residue:
488
  
Inhibitor
Name:
BDBM163633
Synonyms:
SR-3364 US11731934, Compound RLS2-256
Type:
Small organic molecule
Emp. Form.:
C13H17BrN2O
Mol. Mass.:
297.191
SMILES:
Brc1ccc(cc1)C(=O)NNCC1CCCC1
: