Target
Histone deacetylase 3
Ligand
BDBM163634
Substrate
Meas. Tech.
HDAC Inhibition
IC50
>50000±n/a nM
Citation
 Liao, DRoush, WRStowe, RL HDAC inhibitor compounds and methods of treatment US Patent  US10807944 Publication Date 10/20/2020 
Target
Name:
Histone deacetylase 3
Synonyms:
HD3 HDAC3_HUMAN Human HDAC3 SMAP45
Type:
Enzyme
Mol. Mass.:
48829.55
Organism:
Homo sapiens (Human)
Description:
O15379
Residue:
428
  
Inhibitor
Name:
BDBM163634
Synonyms:
SR-3365 US11731934, Compound RLS2-257
Type:
Small organic molecule
Emp. Form.:
C15H21BrN2O
Mol. Mass.:
325.244
SMILES:
Brc1ccc(cc1)C(=O)NNCCCC1CCCC1
: