Target
Histone deacetylase 6
Ligand
BDBM468602
Substrate
Meas. Tech.
HDAC Inhibition
IC50
9.00±n/a nM
Citation
 Liao, DRoush, WRStowe, RL HDAC inhibitor compounds and methods of treatment US Patent  US10807944 Publication Date 10/20/2020 
Target
Name:
Histone deacetylase 6
Synonyms:
Cereblon/Histone deacetylase 6 HDAC6 Histone deacetylase 6 (HDAC6) KIAA0901 | ORF Names:JM21
Type:
Chromatin regulator; hydrolase; repressor
Mol. Mass.:
131381.51
Organism:
Homo sapiens (Human)
Description:
Q9UBN7
Residue:
1215
  
Inhibitor
Name:
BDBM468602
Synonyms:
US10807944, Compound RLS2-312 | US11731934, Compound RLS2-312
Type:
Small organic molecule
Emp. Form.:
C12H17N5O
Mol. Mass.:
247.2963
SMILES:
CCCCNNC(=O)c1ccc(CN=[N+]=[N-])cc1
: