Target
Histone deacetylase 1
Ligand
BDBM468612
Substrate
Meas. Tech.
HDAC Inhibition
IC50
760±n/a nM
Citation
 Liao, DRoush, WRStowe, RL HDAC inhibitor compounds and methods of treatment US Patent  US10807944 Publication Date 10/20/2020 
Target
Name:
Histone deacetylase 1
Synonyms:
Cereblon/Histone deacetylase 1 HDAC1 Histone deacetylase 1 (HDAC1) RPD3L1
Type:
Enzyme
Mol. Mass.:
55090.27
Organism:
Homo sapiens (Human)
Description:
Q13547
Residue:
482
  
Inhibitor
Name:
BDBM468612
Synonyms:
US10807944, Compound SR-4372 | US11731934, Compound SR-4372
Type:
Small organic molecule
Emp. Form.:
C18H21FN2O
Mol. Mass.:
300.3705
SMILES:
CCCCNNC(=O)c1ccc(cc1)-c1cc(C)cc(F)c1
: