Target
Complement factor D
Ligand
BDBM468648
Substrate
Meas. Tech.
TBD
IC50
<1000±n/a nM
Citation
 Wiles, JAPhadke, ASDeshpande, MAgarwal, AChen, DGadhachanda, VRHashimoto, APais, GWang, QWang, XGreenlee, W Compounds for treatment of immune inflammatory disorders US Patent  US10807952 Publication Date 10/20/2020 
Target
Name:
Complement factor D
Synonyms:
Adipsin CFAD_HUMAN DF Properdin factor D
Type:
Protein
Mol. Mass.:
27039.19
Organism:
Homo sapiens (Human)
Description:
P00746
Residue:
253
  
Inhibitor
Name:
BDBM468648
Synonyms:
1-(2-((2S,4R)-2-(3- (benzo[d]thiazol-5- yl)-2- fluorophenyl- carbamoyl)-4- fluoropyrrolidin-1- yl)-2-oxoethyl)-1H- indazole-3- carboxamide | US10807952, Cmp No. 52
Type:
Small organic molecule
Emp. Form.:
C28H22F2N6O3S
Mol. Mass.:
560.574
SMILES:
NC(=O)c1nn(CC(=O)N2C[C@H](F)C[C@H]2C(=O)Nc2cccc(c2F)-c2ccc3scnc3c2)c2ccccc12
: