Target
Complement factor D
Ligand
BDBM468651
Substrate
Meas. Tech.
TBD
IC50
>10000±n/a nM
Citation
 Wiles, JAPhadke, ASDeshpande, MAgarwal, AChen, DGadhachanda, VRHashimoto, APais, GWang, QWang, XGreenlee, W Compounds for treatment of immune inflammatory disorders US Patent  US10807952 Publication Date 10/20/2020 
Target
Name:
Complement factor D
Synonyms:
Adipsin CFAD_HUMAN DF Properdin factor D
Type:
Protein
Mol. Mass.:
27039.19
Organism:
Homo sapiens (Human)
Description:
P00746
Residue:
253
  
Inhibitor
Name:
BDBM468651
Synonyms:
5-(2-((2S,4R)-2-(6- bromopyridin-2- ylcarbamoyl)-4- fluoropyrrolidin-1- yl)-2-oxoethyl)-5H- imidazo[1,2- b]pyrazole-7- carboxamide | US10807952, Cmp No. 55
Type:
Small organic molecule
Emp. Form.:
C18H17BrFN7O3
Mol. Mass.:
478.275
SMILES:
NC(=O)c1cn(CC(=O)N2C[C@H](F)C[C@H]2C(=O)Nc2cccc(Br)n2)n2ccnc12
: