Target
Complement factor D
Ligand
BDBM468691
Substrate
Meas. Tech.
TBD
IC50
<1000±n/a nM
Citation
 Wiles, JAPhadke, ASDeshpande, MAgarwal, AChen, DGadhachanda, VRHashimoto, APais, GWang, QWang, XGreenlee, W Compounds for treatment of immune inflammatory disorders US Patent  US10807952 Publication Date 10/20/2020 
Target
Name:
Complement factor D
Synonyms:
Adipsin CFAD_HUMAN DF Properdin factor D
Type:
Protein
Mol. Mass.:
27039.19
Organism:
Homo sapiens (Human)
Description:
P00746
Residue:
253
  
Inhibitor
Name:
BDBM468691
Synonyms:
(2S,4R)-1-(2-(3- acetyl-1H-indazol- 1-yl)acetyl)-N-(3- (2-aminobenzo[d] thiazol-6-yl)-2- fluorophenyl)-4- fluoropyrrolidine-2- carboxamide | US10807952, Cmp No. 101
Type:
Small organic molecule
Emp. Form.:
C29H24F2N6O3S
Mol. Mass.:
574.601
SMILES:
CC(=O)c1nn(CC(=O)N2C[C@H](F)C[C@H]2C(=O)Nc2cccc(-c3ccc4nc(N)sc4c3)c2F)c2ccccc12
: