Target
WD repeat-containing protein 5
Ligand
BDBM468742
Substrate
Meas. Tech.
TR-FRET Binding Assay
Ki
0.220±n/a nM
Citation
 Gogliotti, RDStauffer, SRJeon, KSalovich, JMMacdonald, JDMills, JJMeyers, KMAlvarado, JRHan, CFesik, SWLee, T WDR5-MLL1 inhibitors and modulators US Patent  US10807959 Publication Date 10/20/2020 
Target
Name:
WD repeat-containing protein 5
Synonyms:
BIG3 WD repeat-containing protein 5 (WDR5) WDR5 | WDR5_HUMAN
Type:
Protein
Mol. Mass.:
36597.13
Organism:
Homo sapiens (Human)
Description:
P61964
Residue:
334
  
Inhibitor
Name:
BDBM468742
Synonyms:
US10807959, Example 11
Type:
Small organic molecule
Emp. Form.:
C24H25FN6O2
Mol. Mass.:
448.4927
SMILES:
COc1ccnc(CNC(=O)c2cc(CNC3=NCCN3)cc(c2)-c2ccc(F)nc2C)c1
: