Target
Nuclear receptor ROR-gamma
Ligand
BDBM317849
Substrate
Meas. Tech.
Radio-Ligand RORgamma Binding Assay (Assay 1)
Ki
<100±n/a nM
Citation
 Claremon, DADillard, LWDong, CFan, YJia, LLiu, ZLotesta, SDMarcus, ASingh, SBTice, CMYuan, JZhao, WZheng, YZhuang, L Dihydropyrrolopyridine inhibitors of ROR-gamma US Patent  US10807980 Publication Date 10/20/2020 
Target
Name:
Nuclear receptor ROR-gamma
Synonyms:
NR1F3 Nuclear receptor ROR-gamma (RORC) RAR-related orphan receptor C (RORc) RORG RZRG Retinoid-related orphan receptor-gamma (RORc)
Type:
Enzyme Catalytic Domain
Mol. Mass.:
58218.40
Organism:
Homo sapiens (Human)
Description:
P51449
Residue:
518
  
Inhibitor
Name:
BDBM317849
Synonyms:
(S)-N-((5-(ethylsulfonyl)pyridin-2-yl)methyl)-7-isopropyl-6-((trans-4-(trifluoromethyl)cyclohexyl)methyl)-6,7-dihydro-5H-pyrrolo[3,4-b]pyridine-3-carboxamide US10807980, Compound 20 US9624217, Compound 2
Type:
Small organic molecule
Emp. Form.:
C28H36F3N3O3S
Mol. Mass.:
551.664
SMILES:
CCS(=O)(=O)c1ccc(CNC(=O)c2cnc3[C@H](C(C)C)N(C[C@H]4CC[C@@H](CC4)C(F)(F)F)Cc3c2)cc1
: