Target
Nuclear receptor ROR-gamma
Ligand
BDBM317881
Substrate
Meas. Tech.
Radio-Ligand RORgamma Binding Assay (Assay 1)
Ki
<100±n/a nM
Citation
 Claremon, DADillard, LWDong, CFan, YJia, LLiu, ZLotesta, SDMarcus, ASingh, SBTice, CMYuan, JZhao, WZheng, YZhuang, L Dihydropyrrolopyridine inhibitors of ROR-gamma US Patent  US10807980 Publication Date 10/20/2020 
Target
Name:
Nuclear receptor ROR-gamma
Synonyms:
NR1F3 Nuclear receptor ROR-gamma (RORC) RAR-related orphan receptor C (RORc) RORG RZRG Retinoid-related orphan receptor-gamma (RORc)
Type:
Enzyme Catalytic Domain
Mol. Mass.:
58218.40
Organism:
Homo sapiens (Human)
Description:
P51449
Residue:
518
  
Inhibitor
Name:
BDBM317881
Synonyms:
US10399976, Compound 34 US11535614, Compound 34 | US9624217, Compound 34
Type:
Small organic molecule
Emp. Form.:
C26H29ClN4O3S
Mol. Mass.:
513.051
SMILES:
CCS(=O)(=O)c1ccc(CNC(=O)c2cnc3[C@H](C(C)C)N(Cc4ccc(Cl)cc4)Cc3c2)nc1
: