Target
Nuclear receptor ROR-gamma
Ligand
BDBM317980
Substrate
Meas. Tech.
Radio-Ligand RORgamma Binding Assay (Assay 1)
Ki
<100±n/a nM
Citation
 Claremon, DADillard, LWDong, CFan, YJia, LLiu, ZLotesta, SDMarcus, ASingh, SBTice, CMYuan, JZhao, WZheng, YZhuang, L Dihydropyrrolopyridine inhibitors of ROR-gamma US Patent  US10807980 Publication Date 10/20/2020 
Target
Name:
Nuclear receptor ROR-gamma
Synonyms:
NR1F3 Nuclear receptor ROR-gamma (RORC) RAR-related orphan receptor C (RORc) RORG RZRG Retinoid-related orphan receptor-gamma (RORc)
Type:
Enzyme Catalytic Domain
Mol. Mass.:
58218.40
Organism:
Homo sapiens (Human)
Description:
P51449
Residue:
518
  
Inhibitor
Name:
BDBM317980
Synonyms:
US10807980, Compound 133 US9624217, Compound 133
Type:
Small organic molecule
Emp. Form.:
C25H30F3N5O3S
Mol. Mass.:
537.598
SMILES:
CCS(=O)(=O)N\C=C(\CNC(=O)c1cnc2[C@H](C(C)C)N(Cc3ccc(cc3)C(F)(F)F)Cc2c1)C=N
: