Target
Menin
Ligand
BDBM470579
Substrate
Meas. Tech.
Test for Evaluating the Inhibition of the Menin-MLL Binding
IC50
7.10±n/a nM
Citation
 Kamioka, SBan, HShimada, NHirose, WArakawa, AYamazaki, KHira, K Optically active azabicyclo ring derivative US Patent  US10815241 Publication Date 10/27/2020 
Target
Name:
Menin
Synonyms:
MEN1 Menin/Histone-lysine N-methyltransferase MLL | SCG2
Type:
Protein
Mol. Mass.:
68022.55
Organism:
Homo sapiens (Human)
Description:
O00255
Residue:
610
  
Inhibitor
Name:
BDBM470579
Synonyms:
US10815241, Example 4 | US11369605, Example 4
Type:
Small organic molecule
Emp. Form.:
C36H49FN6O3
Mol. Mass.:
632.8111
SMILES:
CC(C)N(C(C)C)C(=O)c1cc(F)ccc1Oc1cncnc1N1CC2(C1)CCN(CC2)C(=O)[C@H]1N[C@H]2CC[C@@H]1C[C@H]2CC1CC1
: