Target
Menin
Ligand
BDBM470580
Substrate
Meas. Tech.
Test for Evaluating the Inhibition of the Menin-MLL Binding
IC50
4.10±n/a nM
Citation
 Kamioka, SBan, HShimada, NHirose, WArakawa, AYamazaki, KHira, K Optically active azabicyclo ring derivative US Patent  US10815241 Publication Date 10/27/2020 
Target
Name:
Menin
Synonyms:
MEN1 Menin/Histone-lysine N-methyltransferase MLL | SCG2
Type:
Protein
Mol. Mass.:
68022.55
Organism:
Homo sapiens (Human)
Description:
O00255
Residue:
610
  
Inhibitor
Name:
BDBM470580
Synonyms:
US10815241, Example 5 | US11369605, Example 5
Type:
Small organic molecule
Emp. Form.:
C34H45FN6O3
Mol. Mass.:
604.7579
SMILES:
CC(C)N(C(C)C)C(=O)c1cc(F)ccc1Oc1cncnc1N1CC2(CN(C2)C(=O)[C@H]2N[C@H]3CC[C@@H]2C[C@H]3CC2CC2)C1
: