Target
Epidermal growth factor receptor
Ligand
BDBM470589
Substrate
Meas. Tech.
Luminescent ATP/ADP Detection Assay
IC50
>500±n/a nM
Citation
 Sidduri, A Isoidide derivatives and methods of making and using same US Patent  US10815244 Publication Date 10/27/2020 
Target
Name:
Epidermal growth factor receptor
Synonyms:
EGF Receptor Substrate EGFR_HUMAN ERBB1 Epidermal Growth Factor Receptor erbB-1 Epidermal growth factor receptor (EGFR) HER1 Proto-oncogene c-ErbB-1 Tyrosine-Protein Kinase ErbB-1
Type:
Receptor Kinase Domain
Mol. Mass.:
134279.59
Organism:
Homo sapiens (Human)
Description:
P00533
Residue:
1210
  
Inhibitor
Name:
BDBM470589
Synonyms:
US10815244, Example X
Type:
Small organic molecule
Emp. Form.:
C24H25N3O7
Mol. Mass.:
467.4712
SMILES:
COc1cc2ncnc(Nc3ccc(O[C@H]4CO[C@@H]5[C@H](CO[C@H]45)OC(C)=O)cc3)c2cc1OC
: