Target
Complement factor D
Ligand
BDBM386290
Substrate
Meas. Tech.
Inhibition Assay
IC50
<1000±n/a nM
Citation
 Wiles, JAPhadke, ASDeshpande, MAgarwal, AChen, DGadhachanda, VRHashimoto, APais, GWang, QWang, X Aryl, heteroaryl, and heterocyclic compounds for treatment of medical disorders US Patent  US10822352 Publication Date 11/3/2020 
Target
Name:
Complement factor D
Synonyms:
Adipsin CFAD_HUMAN DF Properdin factor D
Type:
Protein
Mol. Mass.:
27039.19
Organism:
Homo sapiens (Human)
Description:
P00746
Residue:
253
  
Inhibitor
Name:
BDBM386290
Synonyms:
(2S,4R)-1-(2-(3- acetyl-5-(2- methylpyrimidin-5- yl)-1H-indazol-1- yl)acetyl)-4-fluoro- N-(2-fluoro-3- (trifluoromethoxy) phenyl)pyrrolidine- 2-carboxamide US10822352, Comp No. 220
Type:
Small organic molecule
Emp. Form.:
C28H23F5N6O4
Mol. Mass.:
602.512
SMILES:
CC(=O)c1nn(CC(=O)N2C[C@H](F)C[C@H]2C(=O)Nc2cccc(OC(F)(F)F)c2F)c2ccc(cc12)-c1cnc(C)nc1
: