Target
Complement factor D
Ligand
BDBM386432
Substrate
Meas. Tech.
Inhibition Assay
IC50
<1000±n/a nM
Citation
 Wiles, JAPhadke, ASDeshpande, MAgarwal, AChen, DGadhachanda, VRHashimoto, APais, GWang, QWang, X Aryl, heteroaryl, and heterocyclic compounds for treatment of medical disorders US Patent  US10822352 Publication Date 11/3/2020 
Target
Name:
Complement factor D
Synonyms:
Adipsin CFAD_HUMAN DF Properdin factor D
Type:
Protein
Mol. Mass.:
27039.19
Organism:
Homo sapiens (Human)
Description:
P00746
Residue:
253
  
Inhibitor
Name:
BDBM386432
Synonyms:
(1R,3S,5R)-2-(2- (3-acetyl-5-(2- methylpyrimidin- 5-yl)-1H-indazol- 1-yl)acetyl)-N-(6- bromo-4- methoxypyridin- azabicyclo[3.1.0] hexane-3- carboxamide US10822352, Comp No. 366
Type:
Small organic molecule
Emp. Form.:
C28H26BrN7O4
Mol. Mass.:
604.455
SMILES:
COc1cc(Br)nc(NC(=O)[C@@H]2C[C@H]3C[C@H]3N2C(=O)Cn2nc(C(C)=O)c3cc(ccc23)-c2cnc(C)nc2)c1
: