Target
Nuclear receptor ROR-gamma
Ligand
BDBM416491
Substrate
Meas. Tech.
Radio-Ligand Binding Assay
Ki
550±n/a nM
Citation
 Claremon, DADillard, LWFan, YLotesta, SDSingh, SBTice, CMZhao, WZhuang, L Substituted benzoimidazoles as modulators of ROR-γ US Patent  US10829448 Publication Date 11/10/2020 
Target
Name:
Nuclear receptor ROR-gamma
Synonyms:
NR1F3 Nuclear receptor ROR-gamma (RORC) RAR-related orphan receptor C (RORc) RORG RZRG Retinoid-related orphan receptor-gamma (RORc)
Type:
Enzyme Catalytic Domain
Mol. Mass.:
58218.40
Organism:
Homo sapiens (Human)
Description:
P51449
Residue:
518
  
Inhibitor
Name:
BDBM416491
Synonyms:
1-(tert-butyl)-N-((5-(ethylsulfonyl)pyridin-2-yl)methyl)-2-(4-(trifluoromethyl)benzyl)-1H-benzo[d]imidazole-5-carboxamide US10829448, Compound BE-42
Type:
Small organic molecule
Emp. Form.:
C28H29F3N4O3S
Mol. Mass.:
558.615
SMILES:
CCS(=O)(=O)c1ccc(CNC(=O)c2ccc3n(c(Cc4ccc(cc4)C(F)(F)F)nc3c2)C(C)(C)C)nc1
: